{"text_format":"1","workbook":"xlsx","n_sheets":7,"sheets":["Instrucciones","Ejemplo de análisis","Tablas AR","Catálogo amenazas","Activos","Cruces Activo-Amenaza","Análisis de Riesgos"],"not_rendered":{"charts":0,"images":6,"macros":1,"external_links":0,"defined_names":0,"comments":0,"pivot_tables":0},"unopened":[],"bounds":{"document_bytes":16777216,"sheet_cells":100000,"rows_first":2000,"rows_last":500,"rows_between":2000,"halvings":0,"cell_chars":16384,"cell_head_chars":4096},"cells_cut":0,"cells_raw":0,"read":"whole","date_system":"1900"}

{"sheet":"Instrucciones","index":0,"n_rows":22,"n_cols":6,"rows_kept":22,"cut":false,"hidden":false,"merged":[[18,1,18,13],[19,1,19,13],[20,1,20,13],[21,1,21,13],[0,5,1,13],[2,5,3,13]]}
[null,null,null,null,null,"ANÁLISIS DE RIESGOS"]
[]
[null,null,null,null,null,"INSTRUCCIONES PARA REALIZAR LA ACTIVIDAD FINAL"]
[]
[]
["1º","DESCRIPCIÓN DE LA APLICACIÓN:"]
[]
[null,"La presente aplicación ha sido diseñada como herramienta para facilitar el análisis de riesgos solicitado en la actividad final del curso."]
[null,"A continuación se procederá a describir el contenido de cada hoja de la aplicación:"]
["w","Hoja «Ejemplo de análisis»: contiene un ejemplo de análisis de riesgos que podrás utilizar como referencia para realizar la actividad."]
["w","Hoja «Tablas AR»: incluye unas tablas orientativas para realizar las valoraciones de la probabilidad y el impacto según una escala de tres valores."]
["w","Hoja «Catálogo amenazas»: refleja las principales amenazas a considerar en el ámbito de un análisis de riesgos."]
["w","Hoja «Activos»: contiene un listado con los activos definidos para cada uno de los modelos de empresa propuestos en las instrucciones de la actividad final."]
["w","Hoja «Cruces Activo-Amenaza»: se utilizará para especificar las amenazas que afectan a los activos del modelo elegido."]
["w","Hoja «Análisis de Riesgos»: se utilizará para realizar el análisis de riesgos. Se debe indicar la probabilidad y el impacto de cada amenaza sobre cada uno de los activos."]
[]
["2º","FUNCIONAMIENTO DE LA APLICACIÓN:"]
[]
["w","Paso 1: en la hoja «Activos» existe una columna llamada «aplicación». Esta columna contiene una lista de dos opciones (SI/NO). Hay que rellenar con «SI» los activos que se apliquen dependiendo del modelo de empresa elegido (el resto se dejarán en blanco o se rellenarán con «NO»)."]
["w","Paso 2: en la hoja «Cruces Activo-Amenaza» se muestra en la primera columna todas las amenazas y en la primera fila los indicadores de activos (que se corresponden con los de la hoja «Activos»). El objetivo de esta hoja es incluir un «SI» (igual que en el paso 1) en los cruces entre activo y amenaza para que después se muestren automáticamente en la hoja «Análisis de Riesgos». "]
["w","Paso 3: en la hoja «Análisis de Riesgos» se debe pulsar el botón «Mostrar activos» (en la esquina superior izquierda). Este botón mostrará automáticamente todos los activos elegidos, con cada una de las amenazas asociadas a dichos activos."]
["w","Paso 4: en la hoja «Análisis de Riesgos» se debe elegir la probabilidad y el impacto de cada amenaza sobre cada activo (se trata otra vez de una lista, pero con tres posibilidades  (Bajo(1), Medio(2), Alto (3)). Una vez seleccionados se mostrara en la columna riesgos un número que representa el riesgo acorde a la tabla de la hoja «Tablas AR» y el fondo de la casilla del color correspondiente."]

{"sheet":"Ejemplo de análisis","index":1,"n_rows":12,"n_cols":6,"rows_kept":12,"cut":false,"hidden":false,"merged":[[1,1,1,5]]}
[]
[null,"ANÁLISIS DE RIESGOS"]
[null,"ACTIVO","AMENAZA","PROBABILIDAD","IMPACTO","RIESGO"]
[null,"Servidor 01 (Contabilidad)","Fuga de información",2,3,{"$f":"D4*E4","v":6}]
[null,"Servidor 01 (Contabilidad)","Degradación de los soportes de almacenamiento de la información",1,3,3]
[null,"Router Wifi (Clientes)","Caída del sistema por sobrecarga",1,2,2]
[null,"Router Wifi (Clientes)","Denegación de servicio",2,1,2]
[null,"Servidor 02 (Web)","Denegación de servicio",3,2,6]
[null,"Servidor 02 (Web)","Corte del suministro eléctrico",1,2,2]
[null,"…"]
[]
[null,null,"(Añadir a la tabla tantas filas como sea necesario)"]

{"sheet":"Tablas AR","index":2,"n_rows":19,"n_cols":5,"rows_kept":19,"cut":false,"hidden":false,"merged":[[7,1,7,2],[1,1,1,2],[13,1,13,2]]}
[]
[null,"TABLA PARA ESTIMAR LA PROBABILIDAD"]
[null,"VALOR","DESCRIPCIÓN"]
[null,"Bajo (1)","La amenaza se materializa a lo sumo una vez cada año."]
[null,"Medio (2)","La amenaza se materializa a lo sumo una vez cada mes."]
[null,"Alto (3)","La amenaza se materializa a lo sumo una vez cada semana."]
[]
[null,"TABLA PARA ESTIMAR EL IMPACTO"]
[null,"VALOR","DESCRIPCIÓN",null," "]
[null,"Bajo (1)","El daño derivado de la materialización de la amenaza no tiene consecuencias relevantes para la organización. "]
[null,"Medio (2)","El daño derivado de la materialización de la amenaza tiene consecuencias reseñables para la organización."]
[null,"Alto (3)","El daño derivado de la materialización de la amenaza tiene consecuencias graves reseñables para la organización. "]
[]
[null,"CRITERIOS DE ACEPTACIÓN DEL RIESGO"]
[null,"RANGO","DESCRIPCIÓN"]
[null,"Riesgo <= 4","La organización considera el riesgo poco reseñable. "]
[" ","Riesgo > 4","La organización considera el riesgo reseñable y debe proceder a su tratamiento."]
["SI"]
["NO"]

{"sheet":"Catálogo amenazas","index":3,"n_rows":18,"n_cols":10,"rows_kept":18,"cut":false,"hidden":false,"merged":[[7,9,7,11],[2,9,2,11],[3,9,3,11],[4,9,4,11],[1,3,1,7],[1,9,1,11],[6,9,6,11],[8,9,8,11],[9,9,9,11],[10,9,10,11],[11,9,11,11],[9,3,9,7],[10,3,10,7],[11,3,11,7],[14,3,14,7],[15,3,15,7],[16,3,16,7],[17,3,17,7],[2,3,2,7],[3,3,3,7],[4,3,4,7],[5,3,5,7],[6,3,6,7],[8,3,8,7],[12,3,12,7],[13,3,13,7]]}
[]
[null,"Amenazas",null,"Amenazas",null,null,null,null,null,"Amenazas"]
[null,"Fuego",null,"Corte del suministro eléctrico",null,null,null,null,null,"Errores de los usuarios"]
[null,"Daños por agua",null,"Condiciones inadecuadas de temperatura o humedad",null,null,null,null,null,"Errores del administrador"]
[null,"Desastres naturales",null,"Fallo de servicios de comunicaciones",null,null,null,null,null,"Errores de configuración"]
[null,null,null,"Interrupción de otros servicios y suministros esenciales"]
[null,"Amenazas",null,"Desastres industriales",null,null,null,null,null,"Amenazas"]
[null,"Fuga de información",null,null,null,null,null,null,null,"Denegación de servicio"]
[null,"Introducción de falsa información",null,"Amenazas",null,null,null,null,null,"Robo"]
[null,"Alteración de la información",null,"Degradación de los soportes de almacenamiento de la información",null,null,null,null,null,"Indisponibilidad del personal"]
[null,"Corrupción de la información",null,"Difusión de software dañino",null,null,null,null,null,"Extorsión"]
[null,"Destrucción de información",null,"Errores de mantenimiento / actualización de programas (software)",null,null,null,null,null,"Ingeniería social"]
[null,"Interceptación de información (escucha)",null,"Errores de mantenimiento / actualización de equipos (hardware)"]
[null,null,null,"Caída del sistema por sobrecarga"]
[null,null,null,"Pérdida de equipos"]
[null,null,null,"Indisponibilidad del personal"]
[null,null,null,"Abuso de privilegios de acceso"]
[null,null,null,"Acceso no autorizado"]

{"sheet":"Activos","index":4,"n_rows":16,"n_cols":4,"rows_kept":16,"cut":false,"hidden":false,"merged":[[2,0,4,0],[5,0,8,0],[9,0,15,0]]}
[null,"Identificador","Activo","Aplicación"]
[]
["Modelo A","A1","ordenador(es)"]
[null,"A2","móvil(es) principalmente para telefonía"]
[null,"A3","conexión a Internet e incluso wifi"]
["Modelo B","B1","ordenadores y conexión a Internet (con wifi)"]
[null,"B2","dispositivos móviles para telefonía y datos  "]
[null,"B3","soluciones tecnológicas gratuitas para la gestión empresarial como correo electrónico, CRM e incluso herramientas colaborativas o de almacenamiento cloud"]
[null,"B4","una página web sencilla alojada y gestionada por un proveedor externo"]
["Modelo C","C1","ordenadores e incluso algún servidor (web, correo electrónico,…) "]
[null,"C2","conexión a Internet con wifi"]
[null,"C3","dispositivos móviles con datos y apps para su trabajo"]
[null,"C4","herramienta(s) comercial(es) de gestión de negocio (CRM y ERP)"]
[null,"C5","página web / tienda online y redes sociales que gestionan desde la empresa "]
[null,"C6","herramientas para empresas en la nube"]
[null,"C7","e-administración para su relación con las AAPP"]

{"sheet":"Cruces Activo-Amenaza","index":5,"n_rows":32,"n_cols":15,"rows_kept":32,"cut":false,"hidden":false,"merged":[]}
["Amenaza/Activo","A1","A2","A3","B1","B2","B3","B4","C1","C2","C3","C4","C5","C6","C7"]
["Fuego"]
["Daños por agua"]
["Desastres naturales"]
["Fuga de información"]
["Introducción de falsa información"]
["Alteración de la información"]
["Corrupción de la información"]
["Destrucción de información"]
["Interceptación de información (escucha)"]
["Corte del suministro eléctrico"]
["Condiciones inadecuadas de temperatura o humedad"]
["Fallo de servicios de comunicaciones"]
["Interrupción de otros servicios y suministros esenciales"]
["Desastres industriales"]
["Degradación de los soportes de almacenamiento de la información"]
["Difusión de software dañino"]
["Errores de mantenimiento / actualización de programas (software)"]
["Errores de mantenimiento / actualización de equipos (hardware)"]
["Caída del sistema por sobrecarga"]
["Pérdida de equipos"]
["Indisponibilidad del personal"]
["Abuso de privilegios de acceso"]
["Acceso no autorizado"]
["Errores de los usuarios"]
["Errores del administrador"]
["Errores de configuración"]
["Denegación de servicio"]
["Robo"]
["Indisponibilidad del personal"]
["Extorsión"]
["Ingeniería social"]

{"sheet":"Análisis de Riesgos","index":6,"n_rows":933,"n_cols":9,"rows_kept":933,"cut":false,"hidden":false,"merged":[[0,1,0,8]]}
[null,"ANÁLISIS DE RIESGOS"]
[null,"Activo",null,"Amenaza","Probabilidad",null,"Impacto",null,"Riesgo"]
[null,{"$f":"IFERROR(INDEX(Activos!$B$3:$C$16, MATCH(C3,Activos!$B$3:$B$16),2),\"\")","v":""},null,null,null,{"$f":"IF(E3='Tablas AR'!$B$4,1,IF('Análisis de Riesgos'!E3='Tablas AR'!$B$5,2,IF('Análisis de Riesgos'!E3='Tablas AR'!$B$6,3,\"\")))","v":""},null,{"$f":"IF(G3='Tablas AR'!$B$10,1,IF('Análisis de Riesgos'!G3='Tablas AR'!$B$11,2,IF('Análisis de Riesgos'!G3='Tablas AR'!$B$12,3,\"\")))","v":""},{"$f":" IFERROR(F3*H3,\"\")","v":""}]
[null,{"$f":"IFERROR(INDEX(Activos!$B$3:$C$16, MATCH(C4,Activos!$B$3:$B$16),2),\"\")","v":""},null,null,null,{"$f":"IF(E4='Tablas AR'!$B$4,1,IF('Análisis de Riesgos'!E4='Tablas AR'!$B$5,2,IF('Análisis de Riesgos'!E4='Tablas AR'!$B$6,3,\"\")))","v":""},null,{"$f":"IF(G4='Tablas AR'!$B$10,1,IF('Análisis de Riesgos'!G4='Tablas AR'!$B$11,2,IF('Análisis de Riesgos'!G4='Tablas AR'!$B$12,3,\"\")))","v":""},{"$f":" IFERROR(F4*H4,\"\")","v":""}]
[null,{"$f":"IFERROR(INDEX(Activos!$B$3:$C$16, MATCH(C5,Activos!$B$3:$B$16),2),\"\")","v":""},null,null,null,{"$f":"IF(E5='Tablas AR'!$B$4,1,IF('Análisis de Riesgos'!E5='Tablas AR'!$B$5,2,IF('Análisis de Riesgos'!E5='Tablas AR'!$B$6,3,\"\")))","v":""},null,{"$f":"IF(G5='Tablas AR'!$B$10,1,IF('Análisis de Riesgos'!G5='Tablas AR'!$B$11,2,IF('Análisis de Riesgos'!G5='Tablas AR'!$B$12,3,\"\")))","v":""},""]
[null,{"$f":"IFERROR(INDEX(Activos!$B$3:$C$16, MATCH(C6,Activos!$B$3:$B$16),2),\"\")","v":""},null,null,null,{"$f":"IF(E6='Tablas AR'!$B$4,1,IF('Análisis de Riesgos'!E6='Tablas AR'!$B$5,2,IF('Análisis de Riesgos'!E6='Tablas AR'!$B$6,3,\"\")))","v":""},null,{"$f":"IF(G6='Tablas AR'!$B$10,1,IF('Análisis de Riesgos'!G6='Tablas AR'!$B$11,2,IF('Análisis de Riesgos'!G6='Tablas AR'!$B$12,3,\"\")))","v":""},""]
[null,{"$f":"IFERROR(INDEX(Activos!$B$3:$C$16, MATCH(C7,Activos!$B$3:$B$16),2),\"\")","v":""},null,null,null,{"$f":"IF(E7='Tablas AR'!$B$4,1,IF('Análisis de Riesgos'!E7='Tablas AR'!$B$5,2,IF('Análisis de Riesgos'!E7='Tablas AR'!$B$6,3,\"\")))","v":""},null,{"$f":"IF(G7='Tablas AR'!$B$10,1,IF('Análisis de Riesgos'!G7='Tablas AR'!$B$11,2,IF('Análisis de Riesgos'!G7='Tablas AR'!$B$12,3,\"\")))","v":""},""]
[null,{"$f":"IFERROR(INDEX(Activos!$B$3:$C$16, MATCH(C8,Activos!$B$3:$B$16),2),\"\")","v":""},null,null,null,{"$f":"IF(E8='Tablas AR'!$B$4,1,IF('Análisis de Riesgos'!E8='Tablas AR'!$B$5,2,IF('Análisis de Riesgos'!E8='Tablas AR'!$B$6,3,\"\")))","v":""},null,{"$f":"IF(G8='Tablas AR'!$B$10,1,IF('Análisis de Riesgos'!G8='Tablas AR'!$B$11,2,IF('Análisis de Riesgos'!G8='Tablas AR'!$B$12,3,\"\")))","v":""},""]
[null,{"$f":"IFERROR(INDEX(Activos!$B$3:$C$16, MATCH(C9,Activos!$B$3:$B$16),2),\"\")","v":""},null,null,null,{"$f":"IF(E9='Tablas AR'!$B$4,1,IF('Análisis de Riesgos'!E9='Tablas AR'!$B$5,2,IF('Análisis de Riesgos'!E9='Tablas AR'!$B$6,3,\"\")))","v":""},null,{"$f":"IF(G9='Tablas AR'!$B$10,1,IF('Análisis de Riesgos'!G9='Tablas AR'!$B$11,2,IF('Análisis de Riesgos'!G9='Tablas AR'!$B$12,3,\"\")))","v":""},""]
[null,{"$f":"IFERROR(INDEX(Activos!$B$3:$C$16, MATCH(C10,Activos!$B$3:$B$16),2),\"\")","v":""},null,null,null,{"$f":"IF(E10='Tablas AR'!$B$4,1,IF('Análisis de Riesgos'!E10='Tablas AR'!$B$5,2,IF('Análisis de Riesgos'!E10='Tablas AR'!$B$6,3,\"\")))","v":""},null,{"$f":"IF(G10='Tablas AR'!$B$10,1,IF('Análisis de Riesgos'!G10='Tablas AR'!$B$11,2,IF('Análisis de Riesgos'!G10='Tablas AR'!$B$12,3,\"\")))","v":""},""]
[null,{"$f":"IFERROR(INDEX(Activos!$B$3:$C$16, MATCH(C11,Activos!$B$3:$B$16),2),\"\")","v":""},null,null,null,{"$f":"IF(E11='Tablas AR'!$B$4,1,IF('Análisis de Riesgos'!E11='Tablas AR'!$B$5,2,IF('Análisis de Riesgos'!E11='Tablas AR'!$B$6,3,\"\")))","v":""},null,{"$f":"IF(G11='Tablas AR'!$B$10,1,IF('Análisis de Riesgos'!G11='Tablas AR'!$B$11,2,IF('Análisis de Riesgos'!G11='Tablas AR'!$B$12,3,\"\")))","v":""},""]
[null,{"$f":"IFERROR(INDEX(Activos!$B$3:$C$16, MATCH(C12,Activos!$B$3:$B$16),2),\"\")","v":""},null,null,null,{"$f":"IF(E12='Tablas AR'!$B$4,1,IF('Análisis de Riesgos'!E12='Tablas AR'!$B$5,2,IF('Análisis de Riesgos'!E12='Tablas AR'!$B$6,3,\"\")))","v":""},null,{"$f":"IF(G12='Tablas AR'!$B$10,1,IF('Análisis de Riesgos'!G12='Tablas AR'!$B$11,2,IF('Análisis de Riesgos'!G12='Tablas AR'!$B$12,3,\"\")))","v":""},""]
[null,{"$f":"IFERROR(INDEX(Activos!$B$3:$C$16, MATCH(C13,Activos!$B$3:$B$16),2),\"\")","v":""},null,null,null,{"$f":"IF(E13='Tablas AR'!$B$4,1,IF('Análisis de Riesgos'!E13='Tablas AR'!$B$5,2,IF('Análisis de Riesgos'!E13='Tablas AR'!$B$6,3,\"\")))","v":""},null,{"$f":"IF(G13='Tablas AR'!$B$10,1,IF('Análisis de Riesgos'!G13='Tablas AR'!$B$11,2,IF('Análisis de Riesgos'!G13='Tablas AR'!$B$12,3,\"\")))","v":""},""]
[null,{"$f":"IFERROR(INDEX(Activos!$B$3:$C$16, MATCH(C14,Activos!$B$3:$B$16),2),\"\")","v":""},null,null,null,{"$f":"IF(E14='Tablas AR'!$B$4,1,IF('Análisis de Riesgos'!E14='Tablas AR'!$B$5,2,IF('Análisis de Riesgos'!E14='Tablas AR'!$B$6,3,\"\")))","v":""},null,{"$f":"IF(G14='Tablas AR'!$B$10,1,IF('Análisis de Riesgos'!G14='Tablas AR'!$B$11,2,IF('Análisis de Riesgos'!G14='Tablas AR'!$B$12,3,\"\")))","v":""},""]
[null,{"$f":"IFERROR(INDEX(Activos!$B$3:$C$16, MATCH(C15,Activos!$B$3:$B$16),2),\"\")","v":""},null,null,null,{"$f":"IF(E15='Tablas AR'!$B$4,1,IF('Análisis de Riesgos'!E15='Tablas AR'!$B$5,2,IF('Análisis de Riesgos'!E15='Tablas AR'!$B$6,3,\"\")))","v":""},null,{"$f":"IF(G15='Tablas AR'!$B$10,1,IF('Análisis de Riesgos'!G15='Tablas AR'!$B$11,2,IF('Análisis de Riesgos'!G15='Tablas AR'!$B$12,3,\"\")))","v":""},""]
[null,{"$f":"IFERROR(INDEX(Activos!$B$3:$C$16, MATCH(C16,Activos!$B$3:$B$16),2),\"\")","v":""},null,null,null,{"$f":"IF(E16='Tablas AR'!$B$4,1,IF('Análisis de Riesgos'!E16='Tablas AR'!$B$5,2,IF('Análisis de Riesgos'!E16='Tablas AR'!$B$6,3,\"\")))","v":""},null,{"$f":"IF(G16='Tablas AR'!$B$10,1,IF('Análisis de Riesgos'!G16='Tablas AR'!$B$11,2,IF('Análisis de Riesgos'!G16='Tablas AR'!$B$12,3,\"\")))","v":""},""]
[null,{"$f":"IFERROR(INDEX(Activos!$B$3:$C$16, MATCH(C17,Activos!$B$3:$B$16),2),\"\")","v":""},null,null,null,{"$f":"IF(E17='Tablas AR'!$B$4,1,IF('Análisis de Riesgos'!E17='Tablas AR'!$B$5,2,IF('Análisis de Riesgos'!E17='Tablas AR'!$B$6,3,\"\")))","v":""},null,{"$f":"IF(G17='Tablas AR'!$B$10,1,IF('Análisis de Riesgos'!G17='Tablas AR'!$B$11,2,IF('Análisis de Riesgos'!G17='Tablas AR'!$B$12,3,\"\")))","v":""},""]
[null,{"$f":"IFERROR(INDEX(Activos!$B$3:$C$16, MATCH(C18,Activos!$B$3:$B$16),2),\"\")","v":""},null,null,null,{"$f":"IF(E18='Tablas AR'!$B$4,1,IF('Análisis de Riesgos'!E18='Tablas AR'!$B$5,2,IF('Análisis de Riesgos'!E18='Tablas AR'!$B$6,3,\"\")))","v":""},null,{"$f":"IF(G18='Tablas AR'!$B$10,1,IF('Análisis de Riesgos'!G18='Tablas AR'!$B$11,2,IF('Análisis de Riesgos'!G18='Tablas AR'!$B$12,3,\"\")))","v":""},""]
[null,{"$f":"IFERROR(INDEX(Activos!$B$3:$C$16, MATCH(C19,Activos!$B$3:$B$16),2),\"\")","v":""},null,null,null,{"$f":"IF(E19='Tablas AR'!$B$4,1,IF('Análisis de Riesgos'!E19='Tablas AR'!$B$5,2,IF('Análisis de Riesgos'!E19='Tablas AR'!$B$6,3,\"\")))","v":""},null,{"$f":"IF(G19='Tablas AR'!$B$10,1,IF('Análisis de Riesgos'!G19='Tablas AR'!$B$11,2,IF('Análisis de Riesgos'!G19='Tablas AR'!$B$12,3,\"\")))","v":""},""]
[null,{"$f":"IFERROR(INDEX(Activos!$B$3:$C$16, MATCH(C20,Activos!$B$3:$B$16),2),\"\")","v":""},null,null,null,{"$f":"IF(E20='Tablas AR'!$B$4,1,IF('Análisis de Riesgos'!E20='Tablas AR'!$B$5,2,IF('Análisis de Riesgos'!E20='Tablas AR'!$B$6,3,\"\")))","v":""},null,{"$f":"IF(G20='Tablas AR'!$B$10,1,IF('Análisis de Riesgos'!G20='Tablas AR'!$B$11,2,IF('Análisis de Riesgos'!G20='Tablas AR'!$B$12,3,\"\")))","v":""},""]
[null,{"$f":"IFERROR(INDEX(Activos!$B$3:$C$16, MATCH(C21,Activos!$B$3:$B$16),2),\"\")","v":""},null,null,null,{"$f":"IF(E21='Tablas AR'!$B$4,1,IF('Análisis de Riesgos'!E21='Tablas AR'!$B$5,2,IF('Análisis de Riesgos'!E21='Tablas AR'!$B$6,3,\"\")))","v":""},null,{"$f":"IF(G21='Tablas AR'!$B$10,1,IF('Análisis de Riesgos'!G21='Tablas AR'!$B$11,2,IF('Análisis de Riesgos'!G21='Tablas AR'!$B$12,3,\"\")))","v":""},""]
[null,{"$f":"IFERROR(INDEX(Activos!$B$3:$C$16, MATCH(C22,Activos!$B$3:$B$16),2),\"\")","v":""},null,null,null,{"$f":"IF(E22='Tablas AR'!$B$4,1,IF('Análisis de Riesgos'!E22='Tablas AR'!$B$5,2,IF('Análisis de Riesgos'!E22='Tablas AR'!$B$6,3,\"\")))","v":""},null,{"$f":"IF(G22='Tablas AR'!$B$10,1,IF('Análisis de Riesgos'!G22='Tablas AR'!$B$11,2,IF('Análisis de Riesgos'!G22='Tablas AR'!$B$12,3,\"\")))","v":""},""]
[null,{"$f":"IFERROR(INDEX(Activos!$B$3:$C$16, MATCH(C23,Activos!$B$3:$B$16),2),\"\")","v":""},null,null,null,{"$f":"IF(E23='Tablas AR'!$B$4,1,IF('Análisis de Riesgos'!E23='Tablas AR'!$B$5,2,IF('Análisis de Riesgos'!E23='Tablas AR'!$B$6,3,\"\")))","v":""},null,{"$f":"IF(G23='Tablas AR'!$B$10,1,IF('Análisis de Riesgos'!G23='Tablas AR'!$B$11,2,IF('Análisis de Riesgos'!G23='Tablas AR'!$B$12,3,\"\")))","v":""},""]
[null,{"$f":"IFERROR(INDEX(Activos!$B$3:$C$16, MATCH(C24,Activos!$B$3:$B$16),2),\"\")","v":""},null,null,null,{"$f":"IF(E24='Tablas AR'!$B$4,1,IF('Análisis de Riesgos'!E24='Tablas AR'!$B$5,2,IF('Análisis de Riesgos'!E24='Tablas AR'!$B$6,3,\"\")))","v":""},null,{"$f":"IF(G24='Tablas AR'!$B$10,1,IF('Análisis de Riesgos'!G24='Tablas AR'!$B$11,2,IF('Análisis de Riesgos'!G24='Tablas AR'!$B$12,3,\"\")))","v":""},""]
[null,{"$f":"IFERROR(INDEX(Activos!$B$3:$C$16, MATCH(C25,Activos!$B$3:$B$16),2),\"\")","v":""},null,null,null,{"$f":"IF(E25='Tablas AR'!$B$4,1,IF('Análisis de Riesgos'!E25='Tablas AR'!$B$5,2,IF('Análisis de Riesgos'!E25='Tablas AR'!$B$6,3,\"\")))","v":""},null,{"$f":"IF(G25='Tablas AR'!$B$10,1,IF('Análisis de Riesgos'!G25='Tablas AR'!$B$11,2,IF('Análisis de Riesgos'!G25='Tablas AR'!$B$12,3,\"\")))","v":""},""]
[null,{"$f":"IFERROR(INDEX(Activos!$B$3:$C$16, MATCH(C26,Activos!$B$3:$B$16),2),\"\")","v":""},null,null,null,{"$f":"IF(E26='Tablas AR'!$B$4,1,IF('Análisis de Riesgos'!E26='Tablas AR'!$B$5,2,IF('Análisis de Riesgos'!E26='Tablas AR'!$B$6,3,\"\")))","v":""},null,{"$f":"IF(G26='Tablas AR'!$B$10,1,IF('Análisis de Riesgos'!G26='Tablas AR'!$B$11,2,IF('Análisis de Riesgos'!G26='Tablas AR'!$B$12,3,\"\")))","v":""},""]
[null,{"$f":"IFERROR(INDEX(Activos!$B$3:$C$16, MATCH(C27,Activos!$B$3:$B$16),2),\"\")","v":""},null,null,null,{"$f":"IF(E27='Tablas AR'!$B$4,1,IF('Análisis de Riesgos'!E27='Tablas AR'!$B$5,2,IF('Análisis de Riesgos'!E27='Tablas AR'!$B$6,3,\"\")))","v":""},null,{"$f":"IF(G27='Tablas AR'!$B$10,1,IF('Análisis de Riesgos'!G27='Tablas AR'!$B$11,2,IF('Análisis de Riesgos'!G27='Tablas AR'!$B$12,3,\"\")))","v":""},""]
[null,{"$f":"IFERROR(INDEX(Activos!$B$3:$C$16, MATCH(C28,Activos!$B$3:$B$16),2),\"\")","v":""},null,null,null,{"$f":"IF(E28='Tablas AR'!$B$4,1,IF('Análisis de Riesgos'!E28='Tablas AR'!$B$5,2,IF('Análisis de Riesgos'!E28='Tablas AR'!$B$6,3,\"\")))","v":""},null,{"$f":"IF(G28='Tablas AR'!$B$10,1,IF('Análisis de Riesgos'!G28='Tablas AR'!$B$11,2,IF('Análisis de Riesgos'!G28='Tablas AR'!$B$12,3,\"\")))","v":""},""]
[null,{"$f":"IFERROR(INDEX(Activos!$B$3:$C$16, MATCH(C29,Activos!$B$3:$B$16),2),\"\")","v":""},null,null,null,{"$f":"IF(E29='Tablas AR'!$B$4,1,IF('Análisis de Riesgos'!E29='Tablas AR'!$B$5,2,IF('Análisis de Riesgos'!E29='Tablas AR'!$B$6,3,\"\")))","v":""},null,{"$f":"IF(G29='Tablas AR'!$B$10,1,IF('Análisis de Riesgos'!G29='Tablas AR'!$B$11,2,IF('Análisis de Riesgos'!G29='Tablas AR'!$B$12,3,\"\")))","v":""},""]
[null,{"$f":"IFERROR(INDEX(Activos!$B$3:$C$16, MATCH(C30,Activos!$B$3:$B$16),2),\"\")","v":""},null,null,null,{"$f":"IF(E30='Tablas AR'!$B$4,1,IF('Análisis de Riesgos'!E30='Tablas AR'!$B$5,2,IF('Análisis de Riesgos'!E30='Tablas AR'!$B$6,3,\"\")))","v":""},null,{"$f":"IF(G30='Tablas AR'!$B$10,1,IF('Análisis de Riesgos'!G30='Tablas AR'!$B$11,2,IF('Análisis de Riesgos'!G30='Tablas AR'!$B$12,3,\"\")))","v":""},""]
[null,{"$f":"IFERROR(INDEX(Activos!$B$3:$C$16, MATCH(C31,Activos!$B$3:$B$16),2),\"\")","v":""},null,null,null,{"$f":"IF(E31='Tablas AR'!$B$4,1,IF('Análisis de Riesgos'!E31='Tablas AR'!$B$5,2,IF('Análisis de Riesgos'!E31='Tablas AR'!$B$6,3,\"\")))","v":""},null,{"$f":"IF(G31='Tablas AR'!$B$10,1,IF('Análisis de Riesgos'!G31='Tablas AR'!$B$11,2,IF('Análisis de Riesgos'!G31='Tablas AR'!$B$12,3,\"\")))","v":""},""]
[null,{"$f":"IFERROR(INDEX(Activos!$B$3:$C$16, MATCH(C32,Activos!$B$3:$B$16),2),\"\")","v":""},null,null,null,{"$f":"IF(E32='Tablas AR'!$B$4,1,IF('Análisis de Riesgos'!E32='Tablas AR'!$B$5,2,IF('Análisis de Riesgos'!E32='Tablas AR'!$B$6,3,\"\")))","v":""},null,{"$f":"IF(G32='Tablas AR'!$B$10,1,IF('Análisis de Riesgos'!G32='Tablas AR'!$B$11,2,IF('Análisis de Riesgos'!G32='Tablas AR'!$B$12,3,\"\")))","v":""},""]
[null,{"$f":"IFERROR(INDEX(Activos!$B$3:$C$16, MATCH(C33,Activos!$B$3:$B$16),2),\"\")","v":""},null,null,null,{"$f":"IF(E33='Tablas AR'!$B$4,1,IF('Análisis de Riesgos'!E33='Tablas AR'!$B$5,2,IF('Análisis de Riesgos'!E33='Tablas AR'!$B$6,3,\"\")))","v":""},null,{"$f":"IF(G33='Tablas AR'!$B$10,1,IF('Análisis de Riesgos'!G33='Tablas AR'!$B$11,2,IF('Análisis de Riesgos'!G33='Tablas AR'!$B$12,3,\"\")))","v":""},""]
[null,{"$f":"IFERROR(INDEX(Activos!$B$3:$C$16, MATCH(C34,Activos!$B$3:$B$16),2),\"\")","v":""},null,null,null,{"$f":"IF(E34='Tablas AR'!$B$4,1,IF('Análisis de Riesgos'!E34='Tablas AR'!$B$5,2,IF('Análisis de Riesgos'!E34='Tablas AR'!$B$6,3,\"\")))","v":""},null,{"$f":"IF(G34='Tablas AR'!$B$10,1,IF('Análisis de Riesgos'!G34='Tablas AR'!$B$11,2,IF('Análisis de Riesgos'!G34='Tablas AR'!$B$12,3,\"\")))","v":""},""]
[null,{"$f":"IFERROR(INDEX(Activos!$B$3:$C$16, MATCH(C35,Activos!$B$3:$B$16),2),\"\")","v":""},null,null,null,{"$f":"IF(E35='Tablas AR'!$B$4,1,IF('Análisis de Riesgos'!E35='Tablas AR'!$B$5,2,IF('Análisis de Riesgos'!E35='Tablas AR'!$B$6,3,\"\")))","v":""},null,{"$f":"IF(G35='Tablas AR'!$B$10,1,IF('Análisis de Riesgos'!G35='Tablas AR'!$B$11,2,IF('Análisis de Riesgos'!G35='Tablas AR'!$B$12,3,\"\")))","v":""},""]
[null,{"$f":"IFERROR(INDEX(Activos!$B$3:$C$16, MATCH(C36,Activos!$B$3:$B$16),2),\"\")","v":""},null,null,null,{"$f":"IF(E36='Tablas AR'!$B$4,1,IF('Análisis de Riesgos'!E36='Tablas AR'!$B$5,2,IF('Análisis de Riesgos'!E36='Tablas AR'!$B$6,3,\"\")))","v":""},null,{"$f":"IF(G36='Tablas AR'!$B$10,1,IF('Análisis de Riesgos'!G36='Tablas AR'!$B$11,2,IF('Análisis de Riesgos'!G36='Tablas AR'!$B$12,3,\"\")))","v":""},""]
[null,{"$f":"IFERROR(INDEX(Activos!$B$3:$C$16, MATCH(C37,Activos!$B$3:$B$16),2),\"\")","v":""},null,null,null,{"$f":"IF(E37='Tablas AR'!$B$4,1,IF('Análisis de Riesgos'!E37='Tablas AR'!$B$5,2,IF('Análisis de Riesgos'!E37='Tablas AR'!$B$6,3,\"\")))","v":""},null,{"$f":"IF(G37='Tablas AR'!$B$10,1,IF('Análisis de Riesgos'!G37='Tablas AR'!$B$11,2,IF('Análisis de Riesgos'!G37='Tablas AR'!$B$12,3,\"\")))","v":""},""]
[null,{"$f":"IFERROR(INDEX(Activos!$B$3:$C$16, MATCH(C38,Activos!$B$3:$B$16),2),\"\")","v":""},null,null,null,{"$f":"IF(E38='Tablas AR'!$B$4,1,IF('Análisis de Riesgos'!E38='Tablas AR'!$B$5,2,IF('Análisis de Riesgos'!E38='Tablas AR'!$B$6,3,\"\")))","v":""},null,{"$f":"IF(G38='Tablas AR'!$B$10,1,IF('Análisis de Riesgos'!G38='Tablas AR'!$B$11,2,IF('Análisis de Riesgos'!G38='Tablas AR'!$B$12,3,\"\")))","v":""},""]
[null,{"$f":"IFERROR(INDEX(Activos!$B$3:$C$16, MATCH(C39,Activos!$B$3:$B$16),2),\"\")","v":""},null,null,null,{"$f":"IF(E39='Tablas AR'!$B$4,1,IF('Análisis de Riesgos'!E39='Tablas AR'!$B$5,2,IF('Análisis de Riesgos'!E39='Tablas AR'!$B$6,3,\"\")))","v":""},null,{"$f":"IF(G39='Tablas AR'!$B$10,1,IF('Análisis de Riesgos'!G39='Tablas AR'!$B$11,2,IF('Análisis de Riesgos'!G39='Tablas AR'!$B$12,3,\"\")))","v":""},""]
[null,{"$f":"IFERROR(INDEX(Activos!$B$3:$C$16, MATCH(C40,Activos!$B$3:$B$16),2),\"\")","v":""},null,null,null,{"$f":"IF(E40='Tablas AR'!$B$4,1,IF('Análisis de Riesgos'!E40='Tablas AR'!$B$5,2,IF('Análisis de Riesgos'!E40='Tablas AR'!$B$6,3,\"\")))","v":""},null,{"$f":"IF(G40='Tablas AR'!$B$10,1,IF('Análisis de Riesgos'!G40='Tablas AR'!$B$11,2,IF('Análisis de Riesgos'!G40='Tablas AR'!$B$12,3,\"\")))","v":""},""]
{"$rows_left_out":893}